{"text_format":"1","workbook":"xlsx","n_sheets":6,"sheets":["Diagram","Motor","Calc","Calc2","Motor_Mechanic","Kompatibilitätsbericht"],"not_rendered":{"charts":1,"images":9,"macros":1,"external_links":1,"defined_names":42,"comments":0,"pivot_tables":1},"unopened":[],"bounds":{"document_bytes":16777216,"sheet_cells":100000,"rows_first":2000,"rows_last":500,"rows_between":2000,"halvings":0,"cell_chars":16384,"cell_head_chars":4096},"cells_cut":0,"cells_raw":0,"read":"whole","date_system":"1900"}

{"sheet":"Diagram","index":0,"n_rows":21,"n_cols":29,"rows_kept":21,"cut":false,"hidden":false,"merged":[[0,24,1,26],[1,27,6,27],[1,28,6,28],[2,0,2,1],[0,3,1,6],[2,7,2,13],[0,13,1,14],[0,10,1,12],[0,7,1,9],[0,0,1,2]]}
["KOLLMORGEN",null,null,{"$f":"Calc!A2","v":"AKM12E"},null,null,null,{"$f":"IF(Calc!D2,Calc2!A2,\"\")","v":""},null,null,{"$f":"IF(Calc!B2=\"max.\",\"Max motor data\",Calc!B2 )","v":"Servostar 303"},null,null,{"$f":"Calc!C2*1","v":75},null,null,null,null,null,null,null,null,null,null,"Flange Motor 1 (if AKM)",null,null,null,{"$f":"CONCATENATE(MID(AC2,1,4),\"-\",MID(AC2,8,2))","v":"AKM1-AN"}]
[null,null,null,null,null,null,null,null,null,null,null,null,null,null,null,null,null,null,null,null,null,null,null,null,null,null,null,null,{"$f":"Motor_Mechanic!AF6","v":"AKM12E-AN"}]
[]
[]
[]
[]
[null,null,null,null,null,null,null,null,null,null,null,null,null,null,null,null,null,null,null,null,null,null,null,null,null,"Motor","Einheit"]
[]
[null,null,null,null,null,null,null,null,null,null,null,null,null,null,null,null,null,null,null,null,null,null,null,null,null,"Lochkreis","mm",null,{"$f":"SUMIF(Motor_Mechanic!A:A,AC1,Motor_Mechanic!I:I)","v":46}]
[null,null,null,null,null,null,null,null,null,null,null,null,null,null,null,null,null,null,null,null,null,null,null,null,null,"Zentrierung","mm",null,{"$f":"SUMIF(Motor_Mechanic!A:A,AC1,Motor_Mechanic!F:F)","v":30}]
[null,null,null,null,null,null,null,null,null,null,null,null,null,null,null,null,null,null,null,null,null,null,null,null,null,"Welle","mm",null,{"$f":"CONCATENATE(SUMIF(Motor_Mechanic!A:A,AC1,Motor_Mechanic!L:L),\"x\",SUMIF(Motor_Mechanic!A:A,AC1,Motor_Mechanic!O:O))","v":"8x25"}]
[]
[null,null,null,null,null,null,null,null,null,null,null,null,null,null,null,null,null,null,null,null,null,null,null,null,null,"Stillstandsmoment","Nm",null,{"$f":"Calc!G10","v":0.3}]
[null,null,null,null,null,null,null,null,null,null,null,null,null,null,null,null,null,null,null,null,null,null,null,null,null,"Stillstandsstrom","Arms",null,{"$f":"Calc!H10","v":2.72}]
[null,null,null,null,null,null,null,null,null,null,null,null,null,null,null,null,null,null,null,null,null,null,null,null,null,"Max. Drehmoment","Nm",null,{"$f":"Calc!I10","v":1.08}]
[null,null,null,null,null,null,null,null,null,null,null,null,null,null,null,null,null,null,null,null,null,null,null,null,null,"Max. Strom","Arms",null,{"$f":"Calc!D10","v":10.9}]
[null,null,null,null,null,null,null,null,null,null,null,null,null,null,null,null,null,null,null,null,null,null,null,null,null,"Nennmoment","Nm",null,{"$f":"Calc!A142","v":0.3}]
[null,null,null,null,null,null,null,null,null,null,null,null,null,null,null,null,null,null,null,null,null,null,null,null,null,"Nenndrehzahl","rpm",null,{"$f":"Calc!B142","v":3000}]
[null,null,null,null,null,null,null,null,null,null,null,null,null,null,null,null,null,null,null,null,null,null,null,null,null,"Leistung","W",null,{"$f":"(AC17*AC18)/9.55","v":94.240837696335078}]
[null,null,null,null,null,null,null,null,null,null,null,null,null,null,null,null,null,null,null,null,null,null,null,null,null,"Drehmomentkonstante",null,null,{"$f":"AC13/AC14","v":0.11029411764705881}]
{"$rows_left_out":2}
{"sheet":"Motor","index":1,"n_rows":1285,"n_cols":27,"rows_kept":1285,"cut":false,"hidden":true,"merged":[[0,5,0,6],[1,5,7,5],[1,6,7,6],[0,21,7,21],[0,13,0,14],[0,20,7,20],[0,15,0,16],[1,16,7,16],[0,17,0,18],[1,18,7,18],[1,17,7,17],[1,14,7,14],[1,11,7,11],[1,12,7,12],[0,11,0,12],[1,15,7,15],[0,0,7,0],[0,1,7,1],[0,3,7,3],[0,2,7,2],[0,4,7,4],[0,22,7,22],[1,13,7,13],[0,26,7,26],[0,24,7,24],[0,19,7,19],[0,23,7,23],[0,9,0,10],[1,9,7,9],[0,7,0,8],[1,7,7,7],[1,8,7,8],[1,10,7,10]]}
["Motortype","Peak Stall Torque\n[Nm]","Peak Current \n[A]","Cont Stall \nTorque [Nm]","Cont. Stall \nCurrent [A]","24VDC",null,"48VDC",null,"75VDC",null,"160VDC",null,"320VDC",null,"560VDC",null,"640VDC",null,"max Speed\n[1/min]","Inertia\n[kgcm2]","R \n[Ohm]","L\n[mH]","Ke\n[mV/rpm]","Poles",null,"Ist ein SFD Feedback \nMöglich?"]
[null,null,null,null,null,"Cont Rate \nTorque [Nm]","Rated Speed\n[1/min]","Cont Rate \nTorque [Nm]","Rated Speed\n[1/min]","Cont Rate \nTorque [Nm]","Rated Speed\n[1/min]","Cont Rate \nTorque [Nm]","Rated Speed\n[1/min]","Cont Rate \nTorque [Nm]","Rated Speed\n[1/min]","Cont Rate \nTorque [Nm]","Rated Speed\n[1/min]","Cont Rate \nTorque [Nm]","Rated Speed\n[1/min]"]
[]
[]
[]
[]
[]
[]
["6SM27M-4000",1.2,3.5,0.32,0.8,null,null,null,null,null,null,null,null,null,null,0.3,4000,null,null,9000,0.08,31,21,25,6,null,"Nein"]
["6SM27LL-4500",3.2,3.7,0.8,0.82,null,null,null,null,null,null,null,null,null,null,0.72,4500,null,null,9000,0.14000000000000001,37,42,59,6,null,"Nein"]
["6SM37S-6000",1.8,4,0.5,1,null,null,null,null,null,null,null,null,null,null,0.4,6000,null,null,9000,0.45,36,32,30,6,null,"Nein"]
["6SM37M-6000",3.6,6.5,1,1.6,null,null,null,null,null,null,null,null,null,null,0.8,6000,null,null,9000,0.7,12.8,21,38,6,null,"Nein"]
["6SM37L-4000",5.4,6.4,1.5,1.6,null,null,null,null,null,null,null,null,null,null,1.2,4000,null,null,9000,1,15.5,30,58,6,null,"Nein"]
["6SM37VL-6000",10.8,15.2,3,3.8,null,null,null,null,null,null,null,null,null,null,2,6000,null,null,9000,1.6,3.65,8,48,6,null,"Nein"]
["6SM47L-3000",10.6,9,3,2.2999999999999998,null,null,null,null,null,null,null,null,null,null,2.2000000000000002,3000,null,null,6000,1.6,11,25,81,6,null,"Nein"]
["6SM57S-3000",16.3,11,4.5999999999999996,2.8,null,null,null,null,null,null,null,null,null,null,3,3000,null,null,6000,3.1,6.3,35,97,6,null,"Nein"]
["6SM57M-3000",28.5,17,8,4.3,null,null,null,null,null,null,null,null,null,null,6,3000,null,null,6000,4.5,3.9,24,112,6,null,"Nein"]
["6SM77K-3000",39.6,24,11,6,null,null,null,null,null,null,null,null,null,null,8.5,3000,null,null,6000,12,2.2000000000000002,18,112,6,null,"Nein"]
["6SM77S-3000",61.2,40,17,10,null,null,null,null,null,null,null,null,null,null,12,3000,null,null,6000,18,1.1000000000000001,8.3000000000000007,103,6,null,"Nein"]
["6SM107K-3000",100.2,70,26,16,null,null,null,null,null,null,null,null,null,null,20,3000,null,null,6000,82,0.45,4.4000000000000004,97,6,null,"Nein"]
{"$rows_left_out":1266}
{"sheet":"Calc","index":2,"n_rows":155,"n_cols":21,"rows_kept":155,"cut":false,"hidden":true,"merged":[]}
["Motor Nr","Drive Nr","DC-Voltage","2. Motor",null,"AC","DC",null,null,null,"Drives","AC-Voltage","Icont","Ipeak","SFD \nUnterstützung?"]
["AKM12E","Servostar 303","75",false,2,{"$f":"24/SQRT(2)","v":16.970562748477139},{"$f":"IF($C$13>F2,24,\"\")","v":24},null,null,null,"Servostar 303",230,3,9,"Nein"]
[null,"V < 75V",{"$f":"C2*1<G4*1","v":false},null,null,{"$f":"48/SQRT(2)","v":33.941125496954278},{"$f":"IF($C$13>F3,48,\"\")","v":48},null,null,null,"Servostar 306",230,6,15,"Nein"]
[null,null,null,null,null,{"$f":"75/SQRT(2)","v":53.033008588991059},{"$f":"IF($C$13>F4,75,\"\")","v":75},null,null,null,"Servostar 310",230,10,20,"Nein"]
[null,null,null,null,null,{"$f":"160/SQRT(2)","v":113.13708498984759},{"$f":"IF($C$13>F5,160,\"\")","v":160},null,null,null,"Servostar 341",480,1.5,4.5,"Nein"]
[null,null,null,null,null,{"$f":"320/SQRT(2)","v":226.27416997969519},{"$f":"IF($C$13>F6,320,\"\")","v":320},null,null,null,"Servostar 343",480,3,7.5,"Nein"]
[null,null,null,null,null,{"$f":"560/SQRT(2)","v":395.97979746446657},{"$f":"IF($C$13>F7,560,\"\")","v":""},null,null,null,"Servostar 346",480,6,12,"Nein"]
["Motor",null,null,null,null,{"$f":"640/SQRT(2)","v":452.54833995939038},{"$f":"IF($C$13>F8,640,\"\")","v":""},null,null,null,"Servostar 403M/A",230,3,9,"Nein"]
["r","l","ke","Ipeak ","poles","nmax","Mo","Io","Mpeak",null,"Servostar 406M/A",230,6,12,"Nein"]
[{"$f":"IF(C3=TRUE,VLOOKUP($A$2,Motor!$A$9:$Y$1285,22,FALSE)*1.4,VLOOKUP($A$2,Motor!$A$9:$Y$1285,22,FALSE))","v":3.9},{"$f":"VLOOKUP($A$2,Motor!$A$9:$Y$1285,23,FALSE)","v":2.7},{"$f":"VLOOKUP($A$2,Motor!$A$9:$Y$1285,24,FALSE)","v":7.2},{"$f":"VLOOKUP($A$2,Motor!$A$9:$Y$1285,3,FALSE)","v":10.9},{"$f":"VLOOKUP($A$2,Motor!$A$9:$Y$1285,25,FALSE)","v":6},{"$f":"VLOOKUP($A$2,Motor!$A$9:$Y$1285,20,FALSE)","v":8000},{"$f":"VLOOKUP($A$2,Motor!$A$9:$Y$1285,4,FALSE)","v":0.3},{"$f":"VLOOKUP($A$2,Motor!$A$9:$Y$1285,5,FALSE)","v":2.72},{"$f":"VLOOKUP($A$2,Motor!$A$9:$Y$1285,2,FALSE)","v":1.08},null,"Servostar 443M/403A",400,3,9,"Nein"]
["Drive",null,null,null,null,null,{"$f":"G10/H10","v":0.11029411764705881},null,{"$f":"I10/D10","v":9.9082568807339455E-2},null,"Servostar 446M/406A",400,6,12,"Nein"]
["I peak","I rms","AC-Voltage",null,null,null,null,null,null,null,"Servostar 601",480,1.5,3,"Nein"]
[{"$f":"VALUE(VLOOKUP($B$2,$K$2:$N$43,4,FALSE))","v":9},{"$f":"VALUE(VLOOKUP($B$2,$K$2:$N$43,3,FALSE))","v":3},{"$f":"VALUE(VLOOKUP($B$2,$K$2:$N$45,2,FALSE))","v":230},null,null,null,null,null,null,null,"Servostar 603",480,3,6,"Nein"]
[{"$f":"VALUE(VLOOKUP($B$2,$K$2:$N$43,4,FALSE))","v":9},null,null,null,null,null,null,null,null,null,"Servostar 606",480,6,12,"Nein"]
["A - U 18",19,20,3,21,16,4,5,2,null,"Servostar 610",480,10,20,"Nein"]
[null,null,null,null,null,null,null,null,null,null,"Servostar 610/30",480,10,30,"Nein"]
[null,null,null,null,null,null,null,null,null,null,"Servostar 614",480,14,28,"Nein"]
["Cyclic duty",null,null,null,null,null,null,null,null,null,"Servostar 620",480,20,40,"Nein"]
["M","n","a","b","c","speed","Ipeak","Kt","Error_1",null,"Servostar 640",480,40,80,"Nein",null,null,null,null,"Answer_1","Answer_2"]
[{"$f":"VLOOKUP(FALSE,I21:U71,12,0)","v":0.90933187937240378},{"$f":"IF(I21,VLOOKUP(FALSE,I21:U71,13,0),0)","v":0},null,null,null,null,null,null,null,null,"Servostar 670",480,70,140,"Nein"]
{"$rows_left_out":136}
{"sheet":"Calc2","index":3,"n_rows":223,"n_cols":21,"rows_kept":223,"cut":false,"hidden":true,"merged":[]}
["Motor Nr","Drive Nr","DC-Voltage",null,null,{"$f":"Calc!F1","v":"AC"},{"$f":"Calc!G1","v":"DC"},null,null,null,{"$f":"Calc!K1","v":"Drives"},{"$f":"Calc!L1","v":"AC-Voltage"},{"$f":"Calc!M1","v":"Icont"},{"$f":"Calc!N1","v":"Ipeak"},{"$f":"Calc!O1","v":"SFD \nUnterstützung?"}]
["AKM11E",{"$f":"Calc!B2","v":"Servostar 303"},{"$f":"Calc!C2","v":"75"},null,{"$f":"Calc!E2","v":2},{"$f":"Calc!F2","v":16.970562748477139},{"$f":"Calc!G2","v":24},null,null,null,{"$f":"Calc!K2","v":"Servostar 303"},{"$f":"Calc!L2","v":230},{"$f":"Calc!M2","v":3},{"$f":"Calc!N2","v":9},{"$f":"Calc!O2","v":"Nein"}]
[null,{"$f":"Calc!B3","v":"V < 75V"},{"$f":"Calc!C3","v":false},null,null,{"$f":"Calc!F3","v":33.941125496954278},{"$f":"Calc!G3","v":48},null,null,null,{"$f":"Calc!K3","v":"Servostar 306"},{"$f":"Calc!L3","v":230},{"$f":"Calc!M3","v":6},{"$f":"Calc!N3","v":15},{"$f":"Calc!O3","v":"Nein"}]
[null,null,null,null,null,{"$f":"Calc!F4","v":53.033008588991059},{"$f":"Calc!G4","v":75},null,null,null,{"$f":"Calc!K4","v":"Servostar 310"},{"$f":"Calc!L4","v":230},{"$f":"Calc!M4","v":10},{"$f":"Calc!N4","v":20},{"$f":"Calc!O4","v":"Nein"}]
[null,null,null,null,null,{"$f":"Calc!F5","v":113.13708498984759},{"$f":"Calc!G5","v":160},null,null,null,{"$f":"Calc!K5","v":"Servostar 341"},{"$f":"Calc!L5","v":480},{"$f":"Calc!M5","v":1.5},{"$f":"Calc!N5","v":4.5},{"$f":"Calc!O5","v":"Nein"}]
[null,null,null,null,null,{"$f":"Calc!F6","v":226.27416997969519},{"$f":"Calc!G6","v":320},null,null,null,{"$f":"Calc!K6","v":"Servostar 343"},{"$f":"Calc!L6","v":480},{"$f":"Calc!M6","v":3},{"$f":"Calc!N6","v":7.5},{"$f":"Calc!O6","v":"Nein"}]
[null,null,null,null,null,{"$f":"Calc!F7","v":395.97979746446657},{"$f":"Calc!G7","v":""},null,null,null,{"$f":"Calc!K7","v":"Servostar 346"},{"$f":"Calc!L7","v":480},{"$f":"Calc!M7","v":6},{"$f":"Calc!N7","v":12},{"$f":"Calc!O7","v":"Nein"}]
["Motor",null,null,null,null,{"$f":"Calc!F8","v":452.54833995939038},{"$f":"Calc!G8","v":""},null,null,null,{"$f":"Calc!K8","v":"Servostar 403M/A"},{"$f":"Calc!L8","v":230},{"$f":"Calc!M8","v":3},{"$f":"Calc!N8","v":9},{"$f":"Calc!O8","v":"Nein"}]
["r","l","ke","Ipeak ","poles","nmax","Mo","Io","Mpeak",null,{"$f":"Calc!K9","v":"Servostar 406M/A"},{"$f":"Calc!L9","v":230},{"$f":"Calc!M9","v":6},{"$f":"Calc!N9","v":12},{"$f":"Calc!O9","v":"Nein"}]
[{"$f":"IF(C3=TRUE,VLOOKUP($A$2,Motor!$A$9:$Y$1285,22,FALSE)*1.4,VLOOKUP($A$2,Motor!$A$9:$Y$1285,22,FALSE))","v":3.3},{"$f":"VLOOKUP($A$2,Motor!$A$9:$Y$477,23,FALSE)","v":2.04},{"$f":"VLOOKUP($A$2,Motor!$A$9:$Y$477,24,FALSE)","v":4.0999999999999996},{"$f":"VLOOKUP($A$2,Motor!$A$9:$Y$477,3,FALSE)","v":11.6},{"$f":"VLOOKUP($A$2,Motor!$A$9:$Y$477,25,FALSE)","v":6},{"$f":"VLOOKUP($A$2,Motor!$A$9:$Y$477,20,FALSE)","v":8000},{"$f":"VLOOKUP($A$2,Motor!$A$9:$Y$477,4,FALSE)","v":0.19},{"$f":"VLOOKUP($A$2,Motor!$A$9:$Y$477,5,FALSE)","v":2.91},{"$f":"VLOOKUP($A$2,Motor!$A$9:$Y$477,2,FALSE)","v":0.61},null,{"$f":"Calc!K10","v":"Servostar 443M/403A"},{"$f":"Calc!L10","v":400},{"$f":"Calc!M10","v":3},{"$f":"Calc!N10","v":9},{"$f":"Calc!O10","v":"Nein"}]
["Drive",null,null,null,null,null,{"$f":"G10/H10","v":6.5292096219931275E-2},null,{"$f":"I10/D10","v":5.2586206896551725E-2},null,{"$f":"Calc!K11","v":"Servostar 446M/406A"},{"$f":"Calc!L11","v":400},{"$f":"Calc!M11","v":6},{"$f":"Calc!N11","v":12},{"$f":"Calc!O11","v":"Nein"}]
["I peak","I rms",null,null,null,null,null,null,null,null,{"$f":"Calc!K12","v":"Servostar 601"},{"$f":"Calc!L12","v":480},{"$f":"Calc!M12","v":1.5},{"$f":"Calc!N12","v":3},{"$f":"Calc!O12","v":"Nein"}]
[{"$f":"VALUE(VLOOKUP($B$2,$K$2:$N$43,4,FALSE))","v":9},{"$f":"VALUE(VLOOKUP($B$2,$K$2:$N$43,3,FALSE))","v":3},null,null,null,null,null,null,null,null,{"$f":"Calc!K13","v":"Servostar 603"},{"$f":"Calc!L13","v":480},{"$f":"Calc!M13","v":3},{"$f":"Calc!N13","v":6},{"$f":"Calc!O13","v":"Nein"}]
[{"$f":"VALUE(VLOOKUP($B$2,$K$2:$N$43,4,FALSE))","v":9},null,null,null,null,null,null,null,null,null,{"$f":"Calc!K14","v":"Servostar 606"},{"$f":"Calc!L14","v":480},{"$f":"Calc!M14","v":6},{"$f":"Calc!N14","v":12},{"$f":"Calc!O14","v":"Nein"}]
["A - U 18",19,20,3,21,16,4,5,2,null,{"$f":"Calc!K15","v":"Servostar 610"},{"$f":"Calc!L15","v":480},{"$f":"Calc!M15","v":10},{"$f":"Calc!N15","v":20},{"$f":"Calc!O15","v":"Nein"}]
[null,null,null,null,null,null,null,null,null,null,{"$f":"Calc!K16","v":"Servostar 610/30"},{"$f":"Calc!L16","v":480},{"$f":"Calc!M16","v":10},{"$f":"Calc!N16","v":30},{"$f":"Calc!O16","v":"Nein"}]
[null,null,null,null,null,null,null,null,null,null,{"$f":"Calc!K17","v":"Servostar 614"},{"$f":"Calc!L17","v":480},{"$f":"Calc!M17","v":14},{"$f":"Calc!N17","v":28},{"$f":"Calc!O17","v":"Nein"}]
["Cyclic duty",null,null,null,null,null,null,null,null,null,{"$f":"Calc!K18","v":"Servostar 620"},{"$f":"Calc!L18","v":480},{"$f":"Calc!M18","v":20},{"$f":"Calc!N18","v":40},{"$f":"Calc!O18","v":"Nein"}]
["M","n","a","b","c","speed","Ipeak","Kt","Error_1",null,{"$f":"Calc!K19","v":"Servostar 640"},{"$f":"Calc!L19","v":480},{"$f":"Calc!M19","v":40},{"$f":"Calc!N19","v":80},{"$f":"Calc!O19","v":"Nein"},null,null,null,null,"Answer_1","Answer_2"]
[{"$f":"VLOOKUP(FALSE,I21:U71,12,0)","v":0.49890670777302426},{"$f":"IF(I21,VLOOKUP(FALSE,I21:U71,13,0),0)","v":0},null,null,null,null,null,null,null,null,{"$f":"Calc!K20","v":"Servostar 670"},{"$f":"Calc!L20","v":480},{"$f":"Calc!M20","v":70},{"$f":"Calc!N20","v":140},{"$f":"Calc!O20","v":"Nein"}]
{"$rows_left_out":204}
{"sheet":"Motor_Mechanic","index":4,"n_rows":175,"n_cols":34,"rows_kept":175,"cut":false,"hidden":true,"merged":[]}
[null,"Created by Online2PDF.com",null,null,null,null,null,null,null,null,null,null,null,null,null,null,null,null,null,null,null,null,null,null,null,null,"Combination","Is Family","Choosen","Same","possible flange","Flange","Same","(Alle)"]
[null,"                                             AKM Series Brushless Servomotors                                              ",null,null,null,null,null,null,null,null,null,null,null,null,null,null,null,null,null,null,null,null,null,null,null,null,"AKM1-AK",{"$f":"MID(AA2,1,4)","v":"AKM1"},{"$f":"MID(Calc!$A$2,1,4)","v":"AKM1"},{"$f":"AB2=AC2","v":true},{"$f":"IF(AB2=AC2,MID(AA2,6,2),\"\")","v":"AK"},"AN"]
[null,"Mount/Shaft Model Number Codes",null,null,null,null,null,null,null,null,null,null,null,null,null,null,null,null,null,null,null,null,null,null,null,null,"AKM1-AN",{"$f":"MID(AA3,1,4)","v":"AKM1"},{"$f":"MID(Calc!$A$2,1,4)","v":"AKM1"},{"$f":"AB3=AC3","v":true},{"$f":"IF(AB3=AC3,MID(AA3,6,2),\"\")","v":"AN"},"Motor"]
[null,"AKM1xx Models:",null,null,null,null,null,null,null,null,null,null,null,null,null,null,null,null,null,null,null,null,null,null,null,null,"AKM1-BN","AKM1",{"$f":"MID(Calc!$A$2,1,4)","v":"AKM1"},true,"BN",{"$f":"Calc!A2","v":"AKM12E"},"possible flange"]
["Checker","CODE","MOUNT STANDARD","SHAFT STANDARD","BEARING TYPE","PILOT DIAMETER\n(mm)",null,null,"BOLT CIRCLE DIAMETER\n(mm)","HOLE DIAMETER\n(mm)",null,"SHAFT DIAMETER\n(mm)",null,null,"SHAFT LENGTH\n(mm)","KEYWAY TYPE","KEY WIDTH\n(mm)",null,"KEY LENGTH\n(mm)",null,"SHAFT CENTER",null,null,null,null,null,"AKM1-CK","AKM1",{"$f":"MID(Calc!$A$2,1,4)","v":"AKM1"},true,"CK","Kombi","CN"]
["AKM1-AN","AN","-","-","STANDARD",30,0,"h7",46,430,30,8,0,"h7",25,"-","-","-","-",null,"-",null,null,null,null,null,"AKM1-CN","AKM1",{"$f":"MID(Calc!$A$2,1,4)","v":"AKM1"},true,"CN",{"$f":"CONCATENATE(AF4,\"-\",AF2)","v":"AKM12E-AN"},"CK"]
["",null,null,null,null,null,-21,null,null,null,0,null,-15,null,null,null,null,"-",null,null,null,null,null,null,null,null,"AKM2-AC","AKM2",{"$f":"MID(Calc!$A$2,1,4)","v":"AKM1"},false,"",null,"BN"]
["AKM1-AK","AK","-","-","STANDARD",30,0,"h7",46,430,30,8,0,"h7",25,"OPEN",3,0,14,null,"-",null,null,null,null,null,"AKM2-AN","AKM2",{"$f":"MID(Calc!$A$2,1,4)","v":"AKM1"},false,"",null,"AN"]
["",null,null,null,null,null,-21,null,null,null,0,null,-15,null,null,null,null,-25,null,null,null,null,null,null,null,null,"AKM2-BN","AKM2",{"$f":"MID(Calc!$A$2,1,4)","v":"AKM1"},false,"",null,"AK"]
["AKM1-BN","BN","-","-","STANDARD",20.02,2,"-",46.69,356,30,6.35,0,"-",25,"-","-","-","-",null,"-",null,null,null,null,null,"AKM2-CK","AKM2",{"$f":"MID(Calc!$A$2,1,4)","v":"AKM1"},false,""]
["",null,null,null,null,null,-2,null,null,null,0,null,-12,null,null,null,null,"-",null,null,null,null,null,null,null,null,"AKM2-DC","AKM2",{"$f":"MID(Calc!$A$2,1,4)","v":"AKM1"},false,""]
["AKM1-CN","CN","-","-","STANDARD",30,0,"h7",45,340,30,8,0,"h7",25,"-","-","-","-",null,"-",null,null,null,null,null,"AKM2-DN","AKM2",{"$f":"MID(Calc!$A$2,1,4)","v":"AKM1"},false,""]
["",null,null,null,null,null,-21,null,null,null,0,null,-15,null,null,null,null,"-",null,null,null,null,null,null,null,null,"AKM2-EF","AKM2",{"$f":"MID(Calc!$A$2,1,4)","v":"AKM1"},false,""]
["AKM1-CK","CK","-","-","STANDARD",30,0,"h7",45,340,30,8,0,"h7",25,"OPEN",3,0,14,null,"-",null,null,null,null,null,"AKM2-EN","AKM2",{"$f":"MID(Calc!$A$2,1,4)","v":"AKM1"},false,""]
["",null,null,null,null,null,-21,null,null,null,0,null,-15,null,null,null,null,-25,null,null,null,null,null,null,null,null,"AKM3-AC","AKM3",{"$f":"MID(Calc!$A$2,1,4)","v":"AKM1"},false,""]
[null,"AKM2xx Models:",null,null,null,null,null,null,null,null,null,null,null,null,null,null,null,null,null,null,null,null,null,null,null,null,"AKM3-AN","AKM3",{"$f":"MID(Calc!$A$2,1,4)","v":"AKM1"},false,""]
[null,"CODE","MOUNT STANDARD","SHAFT STANDARD","BEARING TYPE","PILOT DIAMETER\n(mm)",null,null,"BOLT CIRCLE DIAMETER\n(mm)","HOLE DIAMETER\n(mm)",null,"SHAFT DIAMETER\n(mm)",null,null,"SHAFT LENGTH\n(mm)","KEYWAY TYPE","KEY WIDTH\n(mm)",null,"KEY LENGTH\n(mm)",null,"SHAFT CENTER",null,null,null,null,null,"AKM3-CC","AKM3",{"$f":"MID(Calc!$A$2,1,4)","v":"AKM1"},false,""]
["AKM2-AN","AN","-","DIN 748","STANDARD",40,11,"j6",63,480,30,9,10,"k6",20,"-","-","-","-",null,"D M3 DIN 332",null,null,null,null,null,"AKM3-CN","AKM3",{"$f":"MID(Calc!$A$2,1,4)","v":"AKM1"},false,""]
["",null,null,null,null,null,-5,null,null,null,0,null,1,null,null,null,null,"-",null,null,null,null,null,null,null,null,"AKM3-GC","AKM3",{"$f":"MID(Calc!$A$2,1,4)","v":"AKM1"},false,""]
["AKM2-AC","AC","-","DIN 748","STANDARD",40,11,"j6",63,480,30,9,10,"k6",20,"CLOSED DIN 6885",3,0,12,null,"D M3 DIN 332",null,null,null,null,null,"AKM3-GN","AKM3",{"$f":"MID(Calc!$A$2,1,4)","v":"AKM1"},false,""]
{"$rows_left_out":156}
{"sheet":"Kompatibilitätsbericht","index":5,"n_rows":16,"n_cols":6,"rows_kept":16,"cut":false,"hidden":true,"merged":[]}
[null,"Kompatibilitätsbericht für überarbeitete Kopie von MotorCurves_V1.64.xls"]
[null,"Ausführen auf 06.10.2017 16:26"]
[]
[null,"Wenn die Arbeitsmappe in einem früheren Dateiformat gespeichert oder in einer früheren Version von Microsoft Excel geöffnet wird, sind die aufgeführten Features nicht verfügbar."]
[]
[null,"Erheblicher Funktionalitätsverlust",null,null,"Anzahl","Version"]
[]
[null,"Von früheren Excel-Versionen werden nur Linienfarben aus der Farbpalette unterstützt. Wenn die Arbeitsmappe in einer früheren Excel-Version geöffnet wird, werden alle Linienfarben der ähnlichsten Farbe in der Farbpalette zugeordnet. In einem Diagramm werden mehrere Datenreihen dann möglicherweise in derselben Farbe angezeigt.",null,null,3]
[null,null,null,null,"Diagram'!A1:AD37","Excel 97-2003"]
[]
[]
[null,"Geringer Genauigkeitsverlust"]
[]
[null,"Einige Formeln in der Arbeitsmappe enthalten Verknüpfungen mit anderen Arbeitsmappen, die geschlossen sind. Wenn diese Formeln in früheren Versionen von Excel neu berechnet werden, ohne dass die verknüpften Arbeitsmappen geöffnet sind, können wegen Beschränkung auf 255 Zeichen maximal 255 Zeichen zurückgegeben werden.",null,null,"33\nFestgelegte Namen","Excel 97-2003"]
[]
[null,"Einige Zellen oder Formatvorlagen in dieser Arbeitsmappe enthalten eine Formatierung, die vom ausgewählten Dateiformat nicht unterstützt wird. Diese Formate werden in das ähnlichste verfügbare Format konvertiert.",null,null,35,"Excel 97-2003"]